{"text_format":"1","workbook":"xlsx","n_sheets":9,"sheets":["Home","Hotel Unique","Hotel Sur la Mer","Banquete IIC","Info","Export Users","Export Accom","Export Accom2","Export Banquet"],"not_rendered":{"charts":0,"images":1,"macros":1,"external_links":0,"defined_names":3,"comments":0,"pivot_tables":0},"unopened":[],"bounds":{"document_bytes":16777216,"sheet_cells":100000,"rows_first":2000,"rows_last":500,"rows_between":2000,"halvings":0,"cell_chars":16384,"cell_head_chars":4096},"cells_cut":0,"cells_raw":0,"read":"whole","date_system":"1900"}

{"sheet":"Home","index":0,"n_rows":26,"n_cols":11,"rows_kept":26,"cut":false,"hidden":false,"merged":[[5,10,7,17],[12,4,12,6],[15,4,15,6],[18,4,18,6],[21,4,21,6],[5,1,5,7],[6,1,6,7],[9,4,9,6]]}
[]
[]
[]
[]
[]
[null,"Accommodation Form",null,null,null,null,null,null,null,null,"IIC Israel 2023"]
[]
[]
[]
[null,null,"Reservation Holder"]
[]
[]
[null,null,"School / Association"]
[]
[]
[null,null,"Country"]
[]
[]
[null,null,"Telephone"]
[]
[]
[null,null,"Email"]
[]
[]
[null,null,"Banquet"]
[null,null,null,null,"Adults",null,"Children"]

{"sheet":"Hotel Unique","index":1,"n_rows":31,"n_cols":18,"rows_kept":31,"cut":false,"hidden":false,"merged":[[23,2,23,5],[6,1,6,2],[10,2,10,5],[6,6,6,7],[7,1,7,2],[1,1,1,12],[2,1,2,12],[29,1,29,3],[29,10,29,12],[29,4,29,5],[29,6,29,7],[29,8,29,9],[16,2,16,5],[15,2,15,5],[6,11,6,12],[7,11,7,12],[24,2,24,5],[4,6,4,7],[20,2,20,5],[21,2,21,5],[22,2,22,5],[7,14,7,15],[30,1,30,3],[30,4,30,5],[30,6,30,7],[30,8,30,9],[30,10,30,12],[11,2,11,5],[12,2,12,5],[13,2,13,5],[14,2,14,5],[17,2,17,5],[18,2,18,5],[19,2,19,5],[9,2,9,5],[27,2,27,7],[27,9,27,12]]}
[]
[null,"Accommodation Form - IIC Israel 2023"]
[null,null,null,null,null,null,null,null,null,null,null,null,null,null,"Single","Double","Triple","Quad"]
[null,null,null,null,null,null,null,null,null,null,null,null,null,null,{"$f":"COUNTIF(J11:J25,1)","v":4},{"$f":"COUNTIF(J11:J25,2)","v":3},{"$f":"COUNTIF(J11:J25,3)","v":0},{"$f":"COUNTIF(J11:J25,4)","v":0}]
[null,null,null,null,null,null,"Hotel Unique",null,null,null,null,null,null,null,"Estandar","Deluxe"]
[null,null,null,null,null,null,null,null,null,null,null,null,null,null,{"$f":"COUNTIF(L11:L25,\"Estandar\")","v":0},{"$f":"COUNTIF(L11:L25,\"Deluxe\")","v":0}]
[null,"Single Room",null,null,null,null,null,null,null,null,null,"Double Room"]
[null,150,null,null,null,null,null,null,null,null,null,75]
[]
[null,"Nr.","Occupants",null,null,null,"Check In","Check Out","Nights","# Pax","Board","Room Type","Price"]
[null,1,"A",null,null,null,"2023-03-28","2023-04-01",{"$f":"IF(C11=\"\",\"\",H11-G11)","v":4},1,{"$f":"IF(J11=\"\",\"\",\"BB\")","v":"BB"},{"$f":"IF(J11=\"\",\"\",IF(J11=1,\"Single\",\"Double\"))","v":"Single"},{"$f":"IF(J11=\"\",\"\",O11*I11)","v":600},null,{"$f":"IF(J11=\"\",\"\",150)","v":150}]
[null,2,"B",null,null,null,"2023-03-29","2023-04-02",{"$f":"IF(C12=\"\",\"\",H12-G12)","v":4},1,{"$f":"IF(J12=\"\",\"\",\"BB\")","v":"BB"},{"$f":"IF(J12=\"\",\"\",IF(J12=1,\"Single\",\"Double\"))","v":"Single"},{"$f":"IF(J12=\"\",\"\",O12*I12)","v":600},null,{"$f":"IF(J12=\"\",\"\",150)","v":150}]
[null,3,"C",null,null,null,"2023-03-30","2023-04-03",4,2,"BB","Double",600,null,150]
[null,4,"D",null,null,null,"2023-03-28","2023-04-04",7,1,"BB","Single",1050,null,150]
[null,5,"E",null,null,null,"2023-03-28","2023-04-02",5,2,"BB","Double",750,null,150]
[null,6,"F",null,null,null,"2023-03-29","2023-04-03",5,1,"BB","Single",750,null,150]
[null,7,"G",null,null,null,"2023-03-30","2023-04-01",2,2,"BB","Double",300,null,150]
[null,8,null,null,null,null,null,null,"",null,"","","",null,""]
[null,9,null,null,null,null,null,null,"",null,"","","",null,""]
[null,10,null,null,null,null,null,null,"",null,"","","",null,""]
[null,11,null,null,null,null,null,null,"",null,"","","",null,""]
[null,12,null,null,null,null,null,null,"",null,"","","",null,""]
[null,13,null,null,null,null,null,null,"",null,"","","",null,""]
[null,14,null,null,null,null,null,null,"",null,"","","",null,""]
[null,15,null,null,null,null,null,null,"",null,"","","",null,""]
[null,null,null,null,null,null,null,null,null,null,null,"Total",{"$f":"SUM(M11:M25)","v":4650},null,null,null,{"$f":"SUM(Q11:Q25)","v":0}]
[]
[null,"BB","Bed and Breakfast",null,null,null,null,null,"IBAN","ES94 0081 0554 8700 0189 3293"]
[]
[null,{"$f":"Home!C10","v":"Reservation Holder"},null,null,{"$f":"Home!C13","v":"School / Association"},null,{"$f":"Home!C16","v":"Country"},null,{"$f":"Home!C19","v":"Telephone"},null,{"$f":"Home!C22","v":"Email"}]
[null,{"$f":"Home!E10","v":0},null,null,{"$f":"Home!E13","v":0},null,{"$f":"Home!E16","v":0},null,{"$f":"Home!E19","v":0},null,{"$f":"Home!E22","v":0}]

{"sheet":"Hotel Sur la Mer","index":2,"n_rows":31,"n_cols":18,"rows_kept":31,"cut":false,"hidden":false,"merged":[[30,1,30,3],[30,4,30,5],[30,6,30,7],[30,8,30,9],[30,10,30,12],[24,2,24,5],[27,2,27,7],[27,9,27,12],[29,1,29,3],[29,4,29,5],[29,6,29,7],[29,8,29,9],[29,10,29,12],[7,14,7,15],[9,2,9,5],[10,2,10,5],[23,2,23,5],[12,2,12,5],[13,2,13,5],[14,2,14,5],[15,2,15,5],[16,2,16,5],[17,2,17,5],[18,2,18,5],[19,2,19,5],[20,2,20,5],[21,2,21,5],[22,2,22,5],[11,2,11,5],[1,1,1,12],[2,1,2,12],[4,6,4,7],[6,1,6,2],[6,6,6,7],[6,11,6,12],[7,1,7,2],[7,11,7,12]]}
[]
[null,"Accommodation Form - IIC Israel 2023"]
[null,null,null,null,null,null,null,null,null,null,null,null,null,null,"Single","Double","Triple","Quad"]
[null,null,null,null,null,null,null,null,null,null,null,null,null,null,{"$f":"COUNTIF(J11:J25,1)","v":0},{"$f":"COUNTIF(J11:J25,2)","v":0},{"$f":"COUNTIF(J11:J25,3)","v":0},{"$f":"COUNTIF(J11:J25,4)","v":0}]
[null,null,null,null,null,null,"Hotel Sur la Mer",null,null,null,null,null,null,null,"Estandar","Deluxe"]
[null,null,null,null,null,null,null,null,null,null,null,null,null,null,{"$f":"COUNTIF(L11:L25,\"Estandar\")","v":0},{"$f":"COUNTIF(L11:L25,\"Deluxe\")","v":0}]
[null,"Single Room",null,null,null,null,null,null,null,null,null,"Double Room"]
[null,180,null,null,null,null,null,null,null,null,null,90]
[]
[null,"Nr.","Occupants",null,null,null,"Check In","Check Out","Nights","# Pax","Board","Room Type","Price"]
[null,1,null,null,null,null,null,null,{"$f":"IF(C11=\"\",\"\",H11-G11)","v":""},null,{"$f":"IF(J11=\"\",\"\",\"BB\")","v":""},{"$f":"IF(J11=\"\",\"\",IF(J11=1,\"Single\",\"Double\"))","v":""},{"$f":"IF(J11=\"\",\"\",O11*I11)","v":""},null,{"$f":"IF(J11=\"\",\"\",180)","v":""}]
[null,2,null,null,null,null,null,null,{"$f":"IF(C12=\"\",\"\",H12-G12)","v":""},null,{"$f":"IF(J12=\"\",\"\",\"BB\")","v":""},{"$f":"IF(J12=\"\",\"\",IF(J12=1,\"Single\",\"Double\"))","v":""},{"$f":"IF(J12=\"\",\"\",O12*I12)","v":""},null,{"$f":"IF(J12=\"\",\"\",180)","v":""}]
[null,3,null,null,null,null,null,null,"",null,"","","",null,""]
[null,4,null,null,null,null,null,null,"",null,"","","",null,""]
[null,5,null,null,null,null,null,null,"",null,"","","",null,""]
[null,6,null,null,null,null,null,null,"",null,"","","",null,""]
[null,7,null,null,null,null,null,null,"",null,"","","",null,""]
[null,8,null,null,null,null,null,null,"",null,"","","",null,""]
[null,9,null,null,null,null,null,null,"",null,"","","",null,""]
[null,10,null,null,null,null,null,null,"",null,"","","",null,""]
[null,11,null,null,null,null,null,null,"",null,"","","",null,""]
[null,12,null,null,null,null,null,null,"",null,"","","",null,""]
[null,13,null,null,null,null,null,null,"",null,"","","",null,""]
[null,14,null,null,null,null,null,null,"",null,"","","",null,""]
[null,15,null,null,null,null,null,null,"",null,"","","",null,""]
[null,null,null,null,null,null,null,null,null,null,null,"Total",{"$f":"SUM(M11:M25)","v":0},null,null,null,{"$f":"SUM(Q11:Q25)","v":0}]
[]
[null,"BB","Bed and Breakfast",null,null,null,null,null,"IBAN","ES94 0081 0554 8700 0189 3293"]
[]
[null,{"$f":"Home!C10","v":"Reservation Holder"},null,null,{"$f":"Home!C13","v":"School / Association"},null,{"$f":"Home!C16","v":"Country"},null,{"$f":"Home!C19","v":"Telephone"},null,{"$f":"Home!C22","v":"Email"}]
[null,{"$f":"Home!E10","v":0},null,null,{"$f":"Home!E13","v":0},null,{"$f":"Home!E16","v":0},null,{"$f":"Home!E19","v":0},null,{"$f":"Home!E22","v":0}]

{"sheet":"Banquete IIC","index":3,"n_rows":31,"n_cols":13,"rows_kept":31,"cut":false,"hidden":false,"merged":[[27,1,27,2],[27,4,27,5],[19,8,19,11],[20,8,20,11],[21,8,21,11],[22,8,22,11],[23,8,23,11],[24,8,24,11],[24,6,24,7],[20,2,20,5],[21,2,21,5],[22,2,22,5],[20,6,20,7],[21,6,21,7],[22,6,22,7],[23,6,23,7],[19,6,19,7],[10,8,10,11],[11,8,11,11],[12,8,12,11],[14,6,14,7],[18,8,18,11],[13,8,13,11],[14,8,14,11],[15,8,15,11],[16,8,16,11],[17,8,17,11],[17,6,17,7],[18,6,18,7],[9,6,9,7],[10,6,10,7],[11,6,11,7],[12,6,12,7],[13,6,13,7],[17,2,17,5],[18,2,18,5],[19,2,19,5],[29,10,29,12],[30,1,30,3],[30,4,30,5],[30,6,30,7],[30,8,30,9],[30,10,30,12],[29,1,29,3],[29,4,29,5],[29,6,29,7],[29,8,29,9],[23,2,23,5],[24,2,24,5],[27,9,27,12],[16,2,16,5],[6,1,6,2],[7,14,7,15],[9,2,9,5],[10,2,10,5],[7,1,7,2],[6,11,6,12],[7,11,7,12],[11,2,11,5],[12,2,12,5],[13,2,13,5],[14,2,14,5],[15,2,15,5],[15,6,15,7],[16,6,16,7],[9,8,9,11],[1,1,1,12],[2,1,2,12],[3,1,3,12],[4,6,4,7],[5,1,5,2],[5,6,5,7]]}
[]
[null,"Dinner Reservation Form - IIC Israel 2023"]
[]
[]
[null,null,null,null,null,null,"Dinner IIC"]
[]
[null,"Adults",null,null,null,null,null,null,null,null,null,"Children"]
[null,50,null,null,null,null,null,null,null,null,null,25]
[]
[null,"Nr.","Guest",null,null,null,"Adult / Child",null,"Allergies or other…",null,null,null,"Price"]
[null,1,null,null,null,null,null,null,null,null,null,null,{"$f":"IF(C11=\"\",\"\",IF(G11=\"Adulto / Adult\",50,25))","v":""}]
[null,2,null,null,null,null,null,null,null,null,null,null,{"$f":"IF(C12=\"\",\"\",IF(G12=\"Adulto / Adult\",50,25))","v":""}]
[null,3,null,null,null,null,null,null,null,null,null,null,""]
[null,4,null,null,null,null,null,null,null,null,null,null,""]
[null,5,null,null,null,null,null,null,null,null,null,null,""]
[null,6,null,null,null,null,null,null,null,null,null,null,""]
[null,7,null,null,null,null,null,null,null,null,null,null,""]
[null,8,null,null,null,null,null,null,null,null,null,null,""]
[null,9,null,null,null,null,null,null,null,null,null,null,""]
[null,10,null,null,null,null,null,null,null,null,null,null,""]
[null,11,null,null,null,null,null,null,null,null,null,null,""]
[null,12,null,null,null,null,null,null,null,null,null,null,""]
[null,13,null,null,null,null,null,null,null,null,null,null,""]
[null,14,null,null,null,null,null,null,null,null,null,null,""]
[null,15,null,null,null,null,null,null,null,null,null,null,""]
[null,null,null,null,null,null,null,null,null,null,null,"Total",{"$f":"SUM(M11:M25)","v":0}]
[]
[null,"Adults",null,{"$f":"COUNTIFS(G11:H25,\"Adulto / Adult\")","v":0},"Children",null,{"$f":"COUNTIFS(G11:H25,\"Niño / Child\")","v":0},null,"IBAN","ES94 0081 0554 8700 0189 3293"]
[]
[null,{"$f":"Home!C10","v":"Reservation Holder"},null,null,{"$f":"Home!C13","v":"School / Association"},null,{"$f":"Home!C16","v":"Country"},null,{"$f":"Home!C19","v":"Telephone"},null,{"$f":"Home!C22","v":"Email"}]
[null,{"$f":"Home!E10","v":0},null,null,{"$f":"Home!E13","v":0},null,{"$f":"Home!E16","v":0},null,{"$f":"Home!E19","v":0},null,{"$f":"Home!E22","v":0}]

{"sheet":"Info","index":4,"n_rows":11,"n_cols":2,"rows_kept":11,"cut":false,"hidden":true,"merged":[]}
["Cant Pax","Tipo Hab"]
[1,"Estandar"]
[2,"Deluxe"]
[3]
[4]
[]
[]
["Cant Pax","Banquete"]
[1,"Adult"]
[2,"Child"]
[3]

{"sheet":"Export Users","index":5,"n_rows":4,"n_cols":20,"rows_kept":4,"cut":false,"hidden":true,"merged":[]}
["Titular","Escuela","Pais","Telefono","Email","Adultos","Niños","Hoteles","Cant Pax","Total Habs","RmNights","Total","1 Pax","2 Pax","3 Pax","4 Pax","Estandar","Deluxe","Jr Suite","Suite"]
[{"$f":"Home!E$10","v":0},{"$f":"Home!E$13","v":0},{"$f":"Home!E$16","v":0},{"$f":"Home!E$19","v":0},{"$f":"Home!E$22","v":0},{"$f":"Home!E$25","v":0},{"$f":"Home!G$25","v":0},"Hotel President",{"$f":"SUM(#REF!)","v":{"$error":"#REF!"}},{"$f":"COUNTA(#REF!)","v":1},{"$f":"#REF!","v":{"$error":"#REF!"}},{"$f":"#REF!","v":{"$error":"#REF!"}},{"$f":"#REF!","v":{"$error":"#REF!"}},{"$f":"#REF!","v":{"$error":"#REF!"}},{"$f":"#REF!","v":{"$error":"#REF!"}},null,{"$f":"#REF!","v":{"$error":"#REF!"}}]
[{"$f":"Home!E$10","v":0},{"$f":"Home!E$13","v":0},{"$f":"Home!E$16","v":0},{"$f":"Home!E$19","v":0},{"$f":"Home!E$22","v":0},{"$f":"Home!E$25","v":0},{"$f":"Home!G$25","v":0},"Hotel El Cervol",{"$f":"SUM('Hotel Unique'!J11:J25)","v":10},{"$f":"COUNTA('Hotel Unique'!C11:F25)","v":7},{"$f":"'Hotel Unique'!Q26","v":0},{"$f":"'Hotel Unique'!M26","v":4650},{"$f":"'Hotel Unique'!O4","v":4},{"$f":"'Hotel Unique'!P4","v":3},{"$f":"'Hotel Unique'!Q4","v":0},{"$f":"'Hotel Unique'!R4","v":0},{"$f":"'Hotel Unique'!O6","v":0},{"$f":"'Hotel Unique'!P6","v":0}]
[{"$f":"Home!E$10","v":0},{"$f":"Home!E$13","v":0},{"$f":"Home!E$16","v":0},{"$f":"Home!E$19","v":0},{"$f":"Home!E$22","v":0},{"$f":"Home!E$25","v":0},{"$f":"Home!G$25","v":0},"Hotel Holiday Inn",{"$f":"SUM(#REF!)","v":{"$error":"#REF!"}},{"$f":"COUNTA(#REF!)","v":1},{"$f":"#REF!","v":{"$error":"#REF!"}},{"$f":"#REF!","v":{"$error":"#REF!"}},{"$f":"#REF!","v":{"$error":"#REF!"}},{"$f":"#REF!","v":{"$error":"#REF!"}},{"$f":"#REF!","v":{"$error":"#REF!"}},null,{"$f":"#REF!","v":{"$error":"#REF!"}}]

{"sheet":"Export Accom","index":6,"n_rows":46,"n_cols":14,"rows_kept":46,"cut":false,"hidden":true,"merged":[]}
["Titular","Club","Pais","Adultos","Niños","Hotel","Ocupantes","Entrada","Salida","Noches","Cant Pax","Regimen","Tipo Hab","Precio"]
[{"$f":"IF(G2=\"\",\"\",Home!E$10)","v":0},{"$f":"IF(G2=\"\",\"\",Home!E$13)","v":0},{"$f":"IF(G2=\"\",\"\",Home!E$16)","v":0},{"$f":"IF(G2=\"\",\"\",Home!E$25)","v":0},{"$f":"IF(G2=\"\",\"\",Home!G$25)","v":0},{"$f":"IF(A2=\"\",\"\",'Hotel Unique'!G$5)","v":"Hotel Unique"},{"$f":"IF('Hotel Unique'!C11=\"\",\"\",'Hotel Unique'!C11)","v":"A"},{"$f":"IF(A2=\"\",\"\",'Hotel Unique'!G11)","v":"2023-03-28"},{"$f":"IF(A2=\"\",\"\",'Hotel Unique'!H11)","v":"2023-04-01"},{"$f":"IF(A2=\"\",\"\",'Hotel Unique'!I11)","v":4},{"$f":"IF(A2=\"\",\"\",'Hotel Unique'!J11)","v":1},{"$f":"'Hotel Unique'!K11","v":"BB"},{"$f":"IF(A2=\"\",\"\",'Hotel Unique'!L11)","v":"Single"},{"$f":"IF(A2=\"\",\"\",'Hotel Unique'!M11)","v":600}]
[{"$f":"IF(G3=\"\",\"\",Home!E$10)","v":0},{"$f":"IF(G3=\"\",\"\",Home!E$13)","v":0},{"$f":"IF(G3=\"\",\"\",Home!E$16)","v":0},{"$f":"IF(G3=\"\",\"\",Home!E$25)","v":0},{"$f":"IF(G3=\"\",\"\",Home!G$25)","v":0},{"$f":"IF(A3=\"\",\"\",'Hotel Unique'!G$5)","v":"Hotel Unique"},{"$f":"IF('Hotel Unique'!C12=\"\",\"\",'Hotel Unique'!C12)","v":"B"},{"$f":"IF(A3=\"\",\"\",'Hotel Unique'!G12)","v":"2023-03-29"},{"$f":"IF(A3=\"\",\"\",'Hotel Unique'!H12)","v":"2023-04-02"},{"$f":"IF(A3=\"\",\"\",'Hotel Unique'!I12)","v":4},{"$f":"IF(A3=\"\",\"\",'Hotel Unique'!J12)","v":1},{"$f":"'Hotel Unique'!K12","v":"BB"},{"$f":"IF(A3=\"\",\"\",'Hotel Unique'!L12)","v":"Single"},{"$f":"IF(A3=\"\",\"\",'Hotel Unique'!M12)","v":600}]
[{"$f":"IF(G4=\"\",\"\",Home!E$10)","v":0},{"$f":"IF(G4=\"\",\"\",Home!E$13)","v":0},{"$f":"IF(G4=\"\",\"\",Home!E$16)","v":0},{"$f":"IF(G4=\"\",\"\",Home!E$25)","v":0},{"$f":"IF(G4=\"\",\"\",Home!G$25)","v":0},{"$f":"IF(A4=\"\",\"\",'Hotel Unique'!G$5)","v":"Hotel Unique"},{"$f":"IF('Hotel Unique'!C13=\"\",\"\",'Hotel Unique'!C13)","v":"C"},{"$f":"IF(A4=\"\",\"\",'Hotel Unique'!G13)","v":"2023-03-30"},{"$f":"IF(A4=\"\",\"\",'Hotel Unique'!H13)","v":"2023-04-03"},{"$f":"IF(A4=\"\",\"\",'Hotel Unique'!I13)","v":4},{"$f":"IF(A4=\"\",\"\",'Hotel Unique'!J13)","v":2},{"$f":"'Hotel Unique'!K13","v":"BB"},{"$f":"IF(A4=\"\",\"\",'Hotel Unique'!L13)","v":"Double"},{"$f":"IF(A4=\"\",\"\",'Hotel Unique'!M13)","v":600}]
[{"$f":"IF(G5=\"\",\"\",Home!E$10)","v":0},{"$f":"IF(G5=\"\",\"\",Home!E$13)","v":0},{"$f":"IF(G5=\"\",\"\",Home!E$16)","v":0},{"$f":"IF(G5=\"\",\"\",Home!E$25)","v":0},{"$f":"IF(G5=\"\",\"\",Home!G$25)","v":0},{"$f":"IF(A5=\"\",\"\",'Hotel Unique'!G$5)","v":"Hotel Unique"},{"$f":"IF('Hotel Unique'!C14=\"\",\"\",'Hotel Unique'!C14)","v":"D"},{"$f":"IF(A5=\"\",\"\",'Hotel Unique'!G14)","v":"2023-03-28"},{"$f":"IF(A5=\"\",\"\",'Hotel Unique'!H14)","v":"2023-04-04"},{"$f":"IF(A5=\"\",\"\",'Hotel Unique'!I14)","v":7},{"$f":"IF(A5=\"\",\"\",'Hotel Unique'!J14)","v":1},{"$f":"'Hotel Unique'!K14","v":"BB"},{"$f":"IF(A5=\"\",\"\",'Hotel Unique'!L14)","v":"Single"},{"$f":"IF(A5=\"\",\"\",'Hotel Unique'!M14)","v":1050}]
[{"$f":"IF(G6=\"\",\"\",Home!E$10)","v":0},{"$f":"IF(G6=\"\",\"\",Home!E$13)","v":0},{"$f":"IF(G6=\"\",\"\",Home!E$16)","v":0},{"$f":"IF(G6=\"\",\"\",Home!E$25)","v":0},{"$f":"IF(G6=\"\",\"\",Home!G$25)","v":0},{"$f":"IF(A6=\"\",\"\",'Hotel Unique'!G$5)","v":"Hotel Unique"},{"$f":"IF('Hotel Unique'!C15=\"\",\"\",'Hotel Unique'!C15)","v":"E"},{"$f":"IF(A6=\"\",\"\",'Hotel Unique'!G15)","v":"2023-03-28"},{"$f":"IF(A6=\"\",\"\",'Hotel Unique'!H15)","v":"2023-04-02"},{"$f":"IF(A6=\"\",\"\",'Hotel Unique'!I15)","v":5},{"$f":"IF(A6=\"\",\"\",'Hotel Unique'!J15)","v":2},{"$f":"'Hotel Unique'!K15","v":"BB"},{"$f":"IF(A6=\"\",\"\",'Hotel Unique'!L15)","v":"Double"},{"$f":"IF(A6=\"\",\"\",'Hotel Unique'!M15)","v":750}]
[{"$f":"IF(G7=\"\",\"\",Home!E$10)","v":0},{"$f":"IF(G7=\"\",\"\",Home!E$13)","v":0},{"$f":"IF(G7=\"\",\"\",Home!E$16)","v":0},{"$f":"IF(G7=\"\",\"\",Home!E$25)","v":0},{"$f":"IF(G7=\"\",\"\",Home!G$25)","v":0},{"$f":"IF(A7=\"\",\"\",'Hotel Unique'!G$5)","v":"Hotel Unique"},{"$f":"IF('Hotel Unique'!C16=\"\",\"\",'Hotel Unique'!C16)","v":"F"},{"$f":"IF(A7=\"\",\"\",'Hotel Unique'!G16)","v":"2023-03-29"},{"$f":"IF(A7=\"\",\"\",'Hotel Unique'!H16)","v":"2023-04-03"},{"$f":"IF(A7=\"\",\"\",'Hotel Unique'!I16)","v":5},{"$f":"IF(A7=\"\",\"\",'Hotel Unique'!J16)","v":1},{"$f":"'Hotel Unique'!K16","v":"BB"},{"$f":"IF(A7=\"\",\"\",'Hotel Unique'!L16)","v":"Single"},{"$f":"IF(A7=\"\",\"\",'Hotel Unique'!M16)","v":750}]
[{"$f":"IF(G8=\"\",\"\",Home!E$10)","v":0},{"$f":"IF(G8=\"\",\"\",Home!E$13)","v":0},{"$f":"IF(G8=\"\",\"\",Home!E$16)","v":0},{"$f":"IF(G8=\"\",\"\",Home!E$25)","v":0},{"$f":"IF(G8=\"\",\"\",Home!G$25)","v":0},{"$f":"IF(A8=\"\",\"\",'Hotel Unique'!G$5)","v":"Hotel Unique"},{"$f":"IF('Hotel Unique'!C17=\"\",\"\",'Hotel Unique'!C17)","v":"G"},{"$f":"IF(A8=\"\",\"\",'Hotel Unique'!G17)","v":"2023-03-30"},{"$f":"IF(A8=\"\",\"\",'Hotel Unique'!H17)","v":"2023-04-01"},{"$f":"IF(A8=\"\",\"\",'Hotel Unique'!I17)","v":2},{"$f":"IF(A8=\"\",\"\",'Hotel Unique'!J17)","v":2},{"$f":"'Hotel Unique'!K17","v":"BB"},{"$f":"IF(A8=\"\",\"\",'Hotel Unique'!L17)","v":"Double"},{"$f":"IF(A8=\"\",\"\",'Hotel Unique'!M17)","v":300}]
[{"$f":"IF(G9=\"\",\"\",Home!E$10)","v":""},{"$f":"IF(G9=\"\",\"\",Home!E$13)","v":""},{"$f":"IF(G9=\"\",\"\",Home!E$16)","v":""},{"$f":"IF(G9=\"\",\"\",Home!E$25)","v":""},{"$f":"IF(G9=\"\",\"\",Home!G$25)","v":""},{"$f":"IF(A9=\"\",\"\",'Hotel Unique'!G$5)","v":""},{"$f":"IF('Hotel Unique'!C18=\"\",\"\",'Hotel Unique'!C18)","v":""},{"$f":"IF(A9=\"\",\"\",'Hotel Unique'!G18)","v":""},{"$f":"IF(A9=\"\",\"\",'Hotel Unique'!H18)","v":""},{"$f":"IF(A9=\"\",\"\",'Hotel Unique'!I18)","v":""},{"$f":"IF(A9=\"\",\"\",'Hotel Unique'!J18)","v":""},{"$f":"'Hotel Unique'!K18","v":""},{"$f":"IF(A9=\"\",\"\",'Hotel Unique'!L18)","v":""},{"$f":"IF(A9=\"\",\"\",'Hotel Unique'!M18)","v":""}]
[{"$f":"IF(G10=\"\",\"\",Home!E$10)","v":""},{"$f":"IF(G10=\"\",\"\",Home!E$13)","v":""},{"$f":"IF(G10=\"\",\"\",Home!E$16)","v":""},{"$f":"IF(G10=\"\",\"\",Home!E$25)","v":""},{"$f":"IF(G10=\"\",\"\",Home!G$25)","v":""},{"$f":"IF(A10=\"\",\"\",'Hotel Unique'!G$5)","v":""},{"$f":"IF('Hotel Unique'!C19=\"\",\"\",'Hotel Unique'!C19)","v":""},{"$f":"IF(A10=\"\",\"\",'Hotel Unique'!G19)","v":""},{"$f":"IF(A10=\"\",\"\",'Hotel Unique'!H19)","v":""},{"$f":"IF(A10=\"\",\"\",'Hotel Unique'!I19)","v":""},{"$f":"IF(A10=\"\",\"\",'Hotel Unique'!J19)","v":""},{"$f":"'Hotel Unique'!K19","v":""},{"$f":"IF(A10=\"\",\"\",'Hotel Unique'!L19)","v":""},{"$f":"IF(A10=\"\",\"\",'Hotel Unique'!M19)","v":""}]
[{"$f":"IF(G11=\"\",\"\",Home!E$10)","v":""},{"$f":"IF(G11=\"\",\"\",Home!E$13)","v":""},{"$f":"IF(G11=\"\",\"\",Home!E$16)","v":""},{"$f":"IF(G11=\"\",\"\",Home!E$25)","v":""},{"$f":"IF(G11=\"\",\"\",Home!G$25)","v":""},{"$f":"IF(A11=\"\",\"\",'Hotel Unique'!G$5)","v":""},{"$f":"IF('Hotel Unique'!C20=\"\",\"\",'Hotel Unique'!C20)","v":""},{"$f":"IF(A11=\"\",\"\",'Hotel Unique'!G20)","v":""},{"$f":"IF(A11=\"\",\"\",'Hotel Unique'!H20)","v":""},{"$f":"IF(A11=\"\",\"\",'Hotel Unique'!I20)","v":""},{"$f":"IF(A11=\"\",\"\",'Hotel Unique'!J20)","v":""},{"$f":"'Hotel Unique'!K20","v":""},{"$f":"IF(A11=\"\",\"\",'Hotel Unique'!L20)","v":""},{"$f":"IF(A11=\"\",\"\",'Hotel Unique'!M20)","v":""}]
[{"$f":"IF(G12=\"\",\"\",Home!E$10)","v":""},{"$f":"IF(G12=\"\",\"\",Home!E$13)","v":""},{"$f":"IF(G12=\"\",\"\",Home!E$16)","v":""},{"$f":"IF(G12=\"\",\"\",Home!E$25)","v":""},{"$f":"IF(G12=\"\",\"\",Home!G$25)","v":""},{"$f":"IF(A12=\"\",\"\",'Hotel Unique'!G$5)","v":""},{"$f":"IF('Hotel Unique'!C21=\"\",\"\",'Hotel Unique'!C21)","v":""},{"$f":"IF(A12=\"\",\"\",'Hotel Unique'!G21)","v":""},{"$f":"IF(A12=\"\",\"\",'Hotel Unique'!H21)","v":""},{"$f":"IF(A12=\"\",\"\",'Hotel Unique'!I21)","v":""},{"$f":"IF(A12=\"\",\"\",'Hotel Unique'!J21)","v":""},{"$f":"'Hotel Unique'!K21","v":""},{"$f":"IF(A12=\"\",\"\",'Hotel Unique'!L21)","v":""},{"$f":"IF(A12=\"\",\"\",'Hotel Unique'!M21)","v":""}]
[{"$f":"IF(G13=\"\",\"\",Home!E$10)","v":""},{"$f":"IF(G13=\"\",\"\",Home!E$13)","v":""},{"$f":"IF(G13=\"\",\"\",Home!E$16)","v":""},{"$f":"IF(G13=\"\",\"\",Home!E$25)","v":""},{"$f":"IF(G13=\"\",\"\",Home!G$25)","v":""},{"$f":"IF(A13=\"\",\"\",'Hotel Unique'!G$5)","v":""},{"$f":"IF('Hotel Unique'!C22=\"\",\"\",'Hotel Unique'!C22)","v":""},{"$f":"IF(A13=\"\",\"\",'Hotel Unique'!G22)","v":""},{"$f":"IF(A13=\"\",\"\",'Hotel Unique'!H22)","v":""},{"$f":"IF(A13=\"\",\"\",'Hotel Unique'!I22)","v":""},{"$f":"IF(A13=\"\",\"\",'Hotel Unique'!J22)","v":""},{"$f":"'Hotel Unique'!K22","v":""},{"$f":"IF(A13=\"\",\"\",'Hotel Unique'!L22)","v":""},{"$f":"IF(A13=\"\",\"\",'Hotel Unique'!M22)","v":""}]
[{"$f":"IF(G14=\"\",\"\",Home!E$10)","v":""},{"$f":"IF(G14=\"\",\"\",Home!E$13)","v":""},{"$f":"IF(G14=\"\",\"\",Home!E$16)","v":""},{"$f":"IF(G14=\"\",\"\",Home!E$25)","v":""},{"$f":"IF(G14=\"\",\"\",Home!G$25)","v":""},{"$f":"IF(A14=\"\",\"\",'Hotel Unique'!G$5)","v":""},{"$f":"IF('Hotel Unique'!C23=\"\",\"\",'Hotel Unique'!C23)","v":""},{"$f":"IF(A14=\"\",\"\",'Hotel Unique'!G23)","v":""},{"$f":"IF(A14=\"\",\"\",'Hotel Unique'!H23)","v":""},{"$f":"IF(A14=\"\",\"\",'Hotel Unique'!I23)","v":""},{"$f":"IF(A14=\"\",\"\",'Hotel Unique'!J23)","v":""},{"$f":"'Hotel Unique'!K23","v":""},{"$f":"IF(A14=\"\",\"\",'Hotel Unique'!L23)","v":""},{"$f":"IF(A14=\"\",\"\",'Hotel Unique'!M23)","v":""}]
[{"$f":"IF(G15=\"\",\"\",Home!E$10)","v":""},{"$f":"IF(G15=\"\",\"\",Home!E$13)","v":""},{"$f":"IF(G15=\"\",\"\",Home!E$16)","v":""},{"$f":"IF(G15=\"\",\"\",Home!E$25)","v":""},{"$f":"IF(G15=\"\",\"\",Home!G$25)","v":""},{"$f":"IF(A15=\"\",\"\",'Hotel Unique'!G$5)","v":""},{"$f":"IF('Hotel Unique'!C24=\"\",\"\",'Hotel Unique'!C24)","v":""},{"$f":"IF(A15=\"\",\"\",'Hotel Unique'!G24)","v":""},{"$f":"IF(A15=\"\",\"\",'Hotel Unique'!H24)","v":""},{"$f":"IF(A15=\"\",\"\",'Hotel Unique'!I24)","v":""},{"$f":"IF(A15=\"\",\"\",'Hotel Unique'!J24)","v":""},{"$f":"'Hotel Unique'!K24","v":""},{"$f":"IF(A15=\"\",\"\",'Hotel Unique'!L24)","v":""},{"$f":"IF(A15=\"\",\"\",'Hotel Unique'!M24)","v":""}]
[{"$f":"IF(G16=\"\",\"\",Home!E$10)","v":""},{"$f":"IF(G16=\"\",\"\",Home!E$13)","v":""},{"$f":"IF(G16=\"\",\"\",Home!E$16)","v":""},{"$f":"IF(G16=\"\",\"\",Home!E$25)","v":""},{"$f":"IF(G16=\"\",\"\",Home!G$25)","v":""},{"$f":"IF(A16=\"\",\"\",'Hotel Unique'!G$5)","v":""},{"$f":"IF('Hotel Unique'!C25=\"\",\"\",'Hotel Unique'!C25)","v":""},{"$f":"IF(A16=\"\",\"\",'Hotel Unique'!G25)","v":""},{"$f":"IF(A16=\"\",\"\",'Hotel Unique'!H25)","v":""},{"$f":"IF(A16=\"\",\"\",'Hotel Unique'!I25)","v":""},{"$f":"IF(A16=\"\",\"\",'Hotel Unique'!J25)","v":""},{"$f":"'Hotel Unique'!K25","v":""},{"$f":"IF(A16=\"\",\"\",'Hotel Unique'!L25)","v":""},{"$f":"IF(A16=\"\",\"\",'Hotel Unique'!M25)","v":""}]
[{"$f":"IF(G17=\"\",\"\",Home!E$10)","v":{"$error":"#REF!"}},{"$f":"IF(G17=\"\",\"\",Home!E$13)","v":{"$error":"#REF!"}},{"$f":"IF(G17=\"\",\"\",Home!E$16)","v":{"$error":"#REF!"}},{"$f":"IF(G17=\"\",\"\",Home!E$25)","v":{"$error":"#REF!"}},{"$f":"IF(G17=\"\",\"\",Home!G$25)","v":{"$error":"#REF!"}},{"$f":"IF(A17=\"\",\"\",#REF!)","v":{"$error":"#REF!"}},{"$f":"IF(#REF!=\"\",\"\",#REF!)","v":{"$error":"#REF!"}},{"$f":"IF(A17=\"\",\"\",#REF!)","v":{"$error":"#REF!"}},{"$f":"IF(A17=\"\",\"\",#REF!)","v":{"$error":"#REF!"}},{"$f":"IF(A17=\"\",\"\",#REF!)","v":{"$error":"#REF!"}},{"$f":"IF(A17=\"\",\"\",#REF!)","v":{"$error":"#REF!"}},{"$f":"#REF!","v":{"$error":"#REF!"}},{"$f":"#REF!","v":{"$error":"#REF!"}},{"$f":"IF(A17=\"\",\"\",#REF!)","v":{"$error":"#REF!"}}]
[{"$f":"IF(G18=\"\",\"\",Home!E$10)","v":{"$error":"#REF!"}},{"$f":"IF(G18=\"\",\"\",Home!E$13)","v":{"$error":"#REF!"}},{"$f":"IF(G18=\"\",\"\",Home!E$16)","v":{"$error":"#REF!"}},{"$f":"IF(G18=\"\",\"\",Home!E$25)","v":{"$error":"#REF!"}},{"$f":"IF(G18=\"\",\"\",Home!G$25)","v":{"$error":"#REF!"}},{"$f":"IF(A18=\"\",\"\",#REF!)","v":{"$error":"#REF!"}},{"$f":"IF(#REF!=\"\",\"\",#REF!)","v":{"$error":"#REF!"}},{"$f":"IF(A18=\"\",\"\",#REF!)","v":{"$error":"#REF!"}},{"$f":"IF(A18=\"\",\"\",#REF!)","v":{"$error":"#REF!"}},{"$f":"IF(A18=\"\",\"\",#REF!)","v":{"$error":"#REF!"}},{"$f":"IF(A18=\"\",\"\",#REF!)","v":{"$error":"#REF!"}},{"$f":"#REF!","v":{"$error":"#REF!"}},{"$f":"#REF!","v":{"$error":"#REF!"}},{"$f":"IF(A18=\"\",\"\",#REF!)","v":{"$error":"#REF!"}}]
[{"$f":"IF(G19=\"\",\"\",Home!E$10)","v":{"$error":"#REF!"}},{"$f":"IF(G19=\"\",\"\",Home!E$13)","v":{"$error":"#REF!"}},{"$f":"IF(G19=\"\",\"\",Home!E$16)","v":{"$error":"#REF!"}},{"$f":"IF(G19=\"\",\"\",Home!E$25)","v":{"$error":"#REF!"}},{"$f":"IF(G19=\"\",\"\",Home!G$25)","v":{"$error":"#REF!"}},{"$f":"IF(A19=\"\",\"\",#REF!)","v":{"$error":"#REF!"}},{"$f":"IF(#REF!=\"\",\"\",#REF!)","v":{"$error":"#REF!"}},{"$f":"IF(A19=\"\",\"\",#REF!)","v":{"$error":"#REF!"}},{"$f":"IF(A19=\"\",\"\",#REF!)","v":{"$error":"#REF!"}},{"$f":"IF(A19=\"\",\"\",#REF!)","v":{"$error":"#REF!"}},{"$f":"IF(A19=\"\",\"\",#REF!)","v":{"$error":"#REF!"}},{"$f":"#REF!","v":{"$error":"#REF!"}},{"$f":"#REF!","v":{"$error":"#REF!"}},{"$f":"IF(A19=\"\",\"\",#REF!)","v":{"$error":"#REF!"}}]
[{"$f":"IF(G20=\"\",\"\",Home!E$10)","v":{"$error":"#REF!"}},{"$f":"IF(G20=\"\",\"\",Home!E$13)","v":{"$error":"#REF!"}},{"$f":"IF(G20=\"\",\"\",Home!E$16)","v":{"$error":"#REF!"}},{"$f":"IF(G20=\"\",\"\",Home!E$25)","v":{"$error":"#REF!"}},{"$f":"IF(G20=\"\",\"\",Home!G$25)","v":{"$error":"#REF!"}},{"$f":"IF(A20=\"\",\"\",#REF!)","v":{"$error":"#REF!"}},{"$f":"IF(#REF!=\"\",\"\",#REF!)","v":{"$error":"#REF!"}},{"$f":"IF(A20=\"\",\"\",#REF!)","v":{"$error":"#REF!"}},{"$f":"IF(A20=\"\",\"\",#REF!)","v":{"$error":"#REF!"}},{"$f":"IF(A20=\"\",\"\",#REF!)","v":{"$error":"#REF!"}},{"$f":"IF(A20=\"\",\"\",#REF!)","v":{"$error":"#REF!"}},{"$f":"#REF!","v":{"$error":"#REF!"}},{"$f":"#REF!","v":{"$error":"#REF!"}},{"$f":"IF(A20=\"\",\"\",#REF!)","v":{"$error":"#REF!"}}]
[{"$f":"IF(G21=\"\",\"\",Home!E$10)","v":{"$error":"#REF!"}},{"$f":"IF(G21=\"\",\"\",Home!E$13)","v":{"$error":"#REF!"}},{"$f":"IF(G21=\"\",\"\",Home!E$16)","v":{"$error":"#REF!"}},{"$f":"IF(G21=\"\",\"\",Home!E$25)","v":{"$error":"#REF!"}},{"$f":"IF(G21=\"\",\"\",Home!G$25)","v":{"$error":"#REF!"}},{"$f":"IF(A21=\"\",\"\",#REF!)","v":{"$error":"#REF!"}},{"$f":"IF(#REF!=\"\",\"\",#REF!)","v":{"$error":"#REF!"}},{"$f":"IF(A21=\"\",\"\",#REF!)","v":{"$error":"#REF!"}},{"$f":"IF(A21=\"\",\"\",#REF!)","v":{"$error":"#REF!"}},{"$f":"IF(A21=\"\",\"\",#REF!)","v":{"$error":"#REF!"}},{"$f":"IF(A21=\"\",\"\",#REF!)","v":{"$error":"#REF!"}},{"$f":"#REF!","v":{"$error":"#REF!"}},{"$f":"#REF!","v":{"$error":"#REF!"}},{"$f":"IF(A21=\"\",\"\",#REF!)","v":{"$error":"#REF!"}}]
[{"$f":"IF(G22=\"\",\"\",Home!E$10)","v":{"$error":"#REF!"}},{"$f":"IF(G22=\"\",\"\",Home!E$13)","v":{"$error":"#REF!"}},{"$f":"IF(G22=\"\",\"\",Home!E$16)","v":{"$error":"#REF!"}},{"$f":"IF(G22=\"\",\"\",Home!E$25)","v":{"$error":"#REF!"}},{"$f":"IF(G22=\"\",\"\",Home!G$25)","v":{"$error":"#REF!"}},{"$f":"IF(A22=\"\",\"\",#REF!)","v":{"$error":"#REF!"}},{"$f":"IF(#REF!=\"\",\"\",#REF!)","v":{"$error":"#REF!"}},{"$f":"IF(A22=\"\",\"\",#REF!)","v":{"$error":"#REF!"}},{"$f":"IF(A22=\"\",\"\",#REF!)","v":{"$error":"#REF!"}},{"$f":"IF(A22=\"\",\"\",#REF!)","v":{"$error":"#REF!"}},{"$f":"IF(A22=\"\",\"\",#REF!)","v":{"$error":"#REF!"}},{"$f":"#REF!","v":{"$error":"#REF!"}},{"$f":"#REF!","v":{"$error":"#REF!"}},{"$f":"IF(A22=\"\",\"\",#REF!)","v":{"$error":"#REF!"}}]
[{"$f":"IF(G23=\"\",\"\",Home!E$10)","v":{"$error":"#REF!"}},{"$f":"IF(G23=\"\",\"\",Home!E$13)","v":{"$error":"#REF!"}},{"$f":"IF(G23=\"\",\"\",Home!E$16)","v":{"$error":"#REF!"}},{"$f":"IF(G23=\"\",\"\",Home!E$25)","v":{"$error":"#REF!"}},{"$f":"IF(G23=\"\",\"\",Home!G$25)","v":{"$error":"#REF!"}},{"$f":"IF(A23=\"\",\"\",#REF!)","v":{"$error":"#REF!"}},{"$f":"IF(#REF!=\"\",\"\",#REF!)","v":{"$error":"#REF!"}},{"$f":"IF(A23=\"\",\"\",#REF!)","v":{"$error":"#REF!"}},{"$f":"IF(A23=\"\",\"\",#REF!)","v":{"$error":"#REF!"}},{"$f":"IF(A23=\"\",\"\",#REF!)","v":{"$error":"#REF!"}},{"$f":"IF(A23=\"\",\"\",#REF!)","v":{"$error":"#REF!"}},{"$f":"#REF!","v":{"$error":"#REF!"}},{"$f":"#REF!","v":{"$error":"#REF!"}},{"$f":"IF(A23=\"\",\"\",#REF!)","v":{"$error":"#REF!"}}]
[{"$f":"IF(G24=\"\",\"\",Home!E$10)","v":{"$error":"#REF!"}},{"$f":"IF(G24=\"\",\"\",Home!E$13)","v":{"$error":"#REF!"}},{"$f":"IF(G24=\"\",\"\",Home!E$16)","v":{"$error":"#REF!"}},{"$f":"IF(G24=\"\",\"\",Home!E$25)","v":{"$error":"#REF!"}},{"$f":"IF(G24=\"\",\"\",Home!G$25)","v":{"$error":"#REF!"}},{"$f":"IF(A24=\"\",\"\",#REF!)","v":{"$error":"#REF!"}},{"$f":"IF(#REF!=\"\",\"\",#REF!)","v":{"$error":"#REF!"}},{"$f":"IF(A24=\"\",\"\",#REF!)","v":{"$error":"#REF!"}},{"$f":"IF(A24=\"\",\"\",#REF!)","v":{"$error":"#REF!"}},{"$f":"IF(A24=\"\",\"\",#REF!)","v":{"$error":"#REF!"}},{"$f":"IF(A24=\"\",\"\",#REF!)","v":{"$error":"#REF!"}},{"$f":"#REF!","v":{"$error":"#REF!"}},{"$f":"#REF!","v":{"$error":"#REF!"}},{"$f":"IF(A24=\"\",\"\",#REF!)","v":{"$error":"#REF!"}}]
[{"$f":"IF(G25=\"\",\"\",Home!E$10)","v":{"$error":"#REF!"}},{"$f":"IF(G25=\"\",\"\",Home!E$13)","v":{"$error":"#REF!"}},{"$f":"IF(G25=\"\",\"\",Home!E$16)","v":{"$error":"#REF!"}},{"$f":"IF(G25=\"\",\"\",Home!E$25)","v":{"$error":"#REF!"}},{"$f":"IF(G25=\"\",\"\",Home!G$25)","v":{"$error":"#REF!"}},{"$f":"IF(A25=\"\",\"\",#REF!)","v":{"$error":"#REF!"}},{"$f":"IF(#REF!=\"\",\"\",#REF!)","v":{"$error":"#REF!"}},{"$f":"IF(A25=\"\",\"\",#REF!)","v":{"$error":"#REF!"}},{"$f":"IF(A25=\"\",\"\",#REF!)","v":{"$error":"#REF!"}},{"$f":"IF(A25=\"\",\"\",#REF!)","v":{"$error":"#REF!"}},{"$f":"IF(A25=\"\",\"\",#REF!)","v":{"$error":"#REF!"}},{"$f":"#REF!","v":{"$error":"#REF!"}},{"$f":"#REF!","v":{"$error":"#REF!"}},{"$f":"IF(A25=\"\",\"\",#REF!)","v":{"$error":"#REF!"}}]
[{"$f":"IF(G26=\"\",\"\",Home!E$10)","v":{"$error":"#REF!"}},{"$f":"IF(G26=\"\",\"\",Home!E$13)","v":{"$error":"#REF!"}},{"$f":"IF(G26=\"\",\"\",Home!E$16)","v":{"$error":"#REF!"}},{"$f":"IF(G26=\"\",\"\",Home!E$25)","v":{"$error":"#REF!"}},{"$f":"IF(G26=\"\",\"\",Home!G$25)","v":{"$error":"#REF!"}},{"$f":"IF(A26=\"\",\"\",#REF!)","v":{"$error":"#REF!"}},{"$f":"IF(#REF!=\"\",\"\",#REF!)","v":{"$error":"#REF!"}},{"$f":"IF(A26=\"\",\"\",#REF!)","v":{"$error":"#REF!"}},{"$f":"IF(A26=\"\",\"\",#REF!)","v":{"$error":"#REF!"}},{"$f":"IF(A26=\"\",\"\",#REF!)","v":{"$error":"#REF!"}},{"$f":"IF(A26=\"\",\"\",#REF!)","v":{"$error":"#REF!"}},{"$f":"#REF!","v":{"$error":"#REF!"}},{"$f":"#REF!","v":{"$error":"#REF!"}},{"$f":"IF(A26=\"\",\"\",#REF!)","v":{"$error":"#REF!"}}]
[{"$f":"IF(G27=\"\",\"\",Home!E$10)","v":{"$error":"#REF!"}},{"$f":"IF(G27=\"\",\"\",Home!E$13)","v":{"$error":"#REF!"}},{"$f":"IF(G27=\"\",\"\",Home!E$16)","v":{"$error":"#REF!"}},{"$f":"IF(G27=\"\",\"\",Home!E$25)","v":{"$error":"#REF!"}},{"$f":"IF(G27=\"\",\"\",Home!G$25)","v":{"$error":"#REF!"}},{"$f":"IF(A27=\"\",\"\",#REF!)","v":{"$error":"#REF!"}},{"$f":"IF(#REF!=\"\",\"\",#REF!)","v":{"$error":"#REF!"}},{"$f":"IF(A27=\"\",\"\",#REF!)","v":{"$error":"#REF!"}},{"$f":"IF(A27=\"\",\"\",#REF!)","v":{"$error":"#REF!"}},{"$f":"IF(A27=\"\",\"\",#REF!)","v":{"$error":"#REF!"}},{"$f":"IF(A27=\"\",\"\",#REF!)","v":{"$error":"#REF!"}},{"$f":"#REF!","v":{"$error":"#REF!"}},{"$f":"#REF!","v":{"$error":"#REF!"}},{"$f":"IF(A27=\"\",\"\",#REF!)","v":{"$error":"#REF!"}}]
[{"$f":"IF(G28=\"\",\"\",Home!E$10)","v":{"$error":"#REF!"}},{"$f":"IF(G28=\"\",\"\",Home!E$13)","v":{"$error":"#REF!"}},{"$f":"IF(G28=\"\",\"\",Home!E$16)","v":{"$error":"#REF!"}},{"$f":"IF(G28=\"\",\"\",Home!E$25)","v":{"$error":"#REF!"}},{"$f":"IF(G28=\"\",\"\",Home!G$25)","v":{"$error":"#REF!"}},{"$f":"IF(A28=\"\",\"\",#REF!)","v":{"$error":"#REF!"}},{"$f":"IF(#REF!=\"\",\"\",#REF!)","v":{"$error":"#REF!"}},{"$f":"IF(A28=\"\",\"\",#REF!)","v":{"$error":"#REF!"}},{"$f":"IF(A28=\"\",\"\",#REF!)","v":{"$error":"#REF!"}},{"$f":"IF(A28=\"\",\"\",#REF!)","v":{"$error":"#REF!"}},{"$f":"IF(A28=\"\",\"\",#REF!)","v":{"$error":"#REF!"}},{"$f":"#REF!","v":{"$error":"#REF!"}},{"$f":"#REF!","v":{"$error":"#REF!"}},{"$f":"IF(A28=\"\",\"\",#REF!)","v":{"$error":"#REF!"}}]
[{"$f":"IF(G29=\"\",\"\",Home!E$10)","v":{"$error":"#REF!"}},{"$f":"IF(G29=\"\",\"\",Home!E$13)","v":{"$error":"#REF!"}},{"$f":"IF(G29=\"\",\"\",Home!E$16)","v":{"$error":"#REF!"}},{"$f":"IF(G29=\"\",\"\",Home!E$25)","v":{"$error":"#REF!"}},{"$f":"IF(G29=\"\",\"\",Home!G$25)","v":{"$error":"#REF!"}},{"$f":"IF(A29=\"\",\"\",#REF!)","v":{"$error":"#REF!"}},{"$f":"IF(#REF!=\"\",\"\",#REF!)","v":{"$error":"#REF!"}},{"$f":"IF(A29=\"\",\"\",#REF!)","v":{"$error":"#REF!"}},{"$f":"IF(A29=\"\",\"\",#REF!)","v":{"$error":"#REF!"}},{"$f":"IF(A29=\"\",\"\",#REF!)","v":{"$error":"#REF!"}},{"$f":"IF(A29=\"\",\"\",#REF!)","v":{"$error":"#REF!"}},{"$f":"#REF!","v":{"$error":"#REF!"}},{"$f":"#REF!","v":{"$error":"#REF!"}},{"$f":"IF(A29=\"\",\"\",#REF!)","v":{"$error":"#REF!"}}]
[{"$f":"IF(G30=\"\",\"\",Home!E$10)","v":{"$error":"#REF!"}},{"$f":"IF(G30=\"\",\"\",Home!E$13)","v":{"$error":"#REF!"}},{"$f":"IF(G30=\"\",\"\",Home!E$16)","v":{"$error":"#REF!"}},{"$f":"IF(G30=\"\",\"\",Home!E$25)","v":{"$error":"#REF!"}},{"$f":"IF(G30=\"\",\"\",Home!G$25)","v":{"$error":"#REF!"}},{"$f":"IF(A30=\"\",\"\",#REF!)","v":{"$error":"#REF!"}},{"$f":"IF(#REF!=\"\",\"\",#REF!)","v":{"$error":"#REF!"}},{"$f":"IF(A30=\"\",\"\",#REF!)","v":{"$error":"#REF!"}},{"$f":"IF(A30=\"\",\"\",#REF!)","v":{"$error":"#REF!"}},{"$f":"IF(A30=\"\",\"\",#REF!)","v":{"$error":"#REF!"}},{"$f":"IF(A30=\"\",\"\",#REF!)","v":{"$error":"#REF!"}},{"$f":"#REF!","v":{"$error":"#REF!"}},{"$f":"#REF!","v":{"$error":"#REF!"}},{"$f":"IF(A30=\"\",\"\",#REF!)","v":{"$error":"#REF!"}}]
[{"$f":"IF(G31=\"\",\"\",Home!E$10)","v":{"$error":"#REF!"}},{"$f":"IF(G31=\"\",\"\",Home!E$13)","v":{"$error":"#REF!"}},{"$f":"IF(G31=\"\",\"\",Home!E$16)","v":{"$error":"#REF!"}},{"$f":"IF(G31=\"\",\"\",Home!E$25)","v":{"$error":"#REF!"}},{"$f":"IF(G31=\"\",\"\",Home!G$25)","v":{"$error":"#REF!"}},{"$f":"IF(A31=\"\",\"\",#REF!)","v":{"$error":"#REF!"}},{"$f":"IF(#REF!=\"\",\"\",#REF!)","v":{"$error":"#REF!"}},{"$f":"IF(A31=\"\",\"\",#REF!)","v":{"$error":"#REF!"}},{"$f":"IF(A31=\"\",\"\",#REF!)","v":{"$error":"#REF!"}},{"$f":"IF(A31=\"\",\"\",#REF!)","v":{"$error":"#REF!"}},{"$f":"IF(A31=\"\",\"\",#REF!)","v":{"$error":"#REF!"}},{"$f":"#REF!","v":{"$error":"#REF!"}},{"$f":"#REF!","v":{"$error":"#REF!"}},{"$f":"IF(A31=\"\",\"\",#REF!)","v":{"$error":"#REF!"}}]
[{"$f":"IF(G32=\"\",\"\",Home!E$10)","v":{"$error":"#REF!"}},{"$f":"IF(G32=\"\",\"\",Home!E$13)","v":{"$error":"#REF!"}},{"$f":"IF(G32=\"\",\"\",Home!E$16)","v":{"$error":"#REF!"}},{"$f":"IF(G32=\"\",\"\",Home!E$25)","v":{"$error":"#REF!"}},{"$f":"IF(G32=\"\",\"\",Home!G$25)","v":{"$error":"#REF!"}},{"$f":"IF(A32=\"\",\"\",#REF!)","v":{"$error":"#REF!"}},{"$f":"IF(#REF!=\"\",\"\",#REF!)","v":{"$error":"#REF!"}},{"$f":"IF(A32=\"\",\"\",#REF!)","v":{"$error":"#REF!"}},{"$f":"IF(A32=\"\",\"\",#REF!)","v":{"$error":"#REF!"}},{"$f":"IF(A32=\"\",\"\",#REF!)","v":{"$error":"#REF!"}},{"$f":"IF(A32=\"\",\"\",#REF!)","v":{"$error":"#REF!"}},{"$f":"#REF!","v":{"$error":"#REF!"}},{"$f":"#REF!","v":{"$error":"#REF!"}},{"$f":"IF(A32=\"\",\"\",#REF!)","v":{"$error":"#REF!"}}]
[{"$f":"IF(G33=\"\",\"\",Home!E$10)","v":{"$error":"#REF!"}},{"$f":"IF(G33=\"\",\"\",Home!E$13)","v":{"$error":"#REF!"}},{"$f":"IF(G33=\"\",\"\",Home!E$16)","v":{"$error":"#REF!"}},{"$f":"IF(G33=\"\",\"\",Home!E$25)","v":{"$error":"#REF!"}},{"$f":"IF(G33=\"\",\"\",Home!G$25)","v":{"$error":"#REF!"}},{"$f":"IF(A33=\"\",\"\",#REF!)","v":{"$error":"#REF!"}},{"$f":"IF(#REF!=\"\",\"\",#REF!)","v":{"$error":"#REF!"}},{"$f":"IF(A33=\"\",\"\",#REF!)","v":{"$error":"#REF!"}},{"$f":"IF(A33=\"\",\"\",#REF!)","v":{"$error":"#REF!"}},{"$f":"IF(A33=\"\",\"\",#REF!)","v":{"$error":"#REF!"}},{"$f":"IF(A33=\"\",\"\",#REF!)","v":{"$error":"#REF!"}},{"$f":"#REF!","v":{"$error":"#REF!"}},{"$f":"#REF!","v":{"$error":"#REF!"}},{"$f":"IF(A33=\"\",\"\",#REF!)","v":{"$error":"#REF!"}}]
[{"$f":"IF(G34=\"\",\"\",Home!E$10)","v":{"$error":"#REF!"}},{"$f":"IF(G34=\"\",\"\",Home!E$13)","v":{"$error":"#REF!"}},{"$f":"IF(G34=\"\",\"\",Home!E$16)","v":{"$error":"#REF!"}},{"$f":"IF(G34=\"\",\"\",Home!E$25)","v":{"$error":"#REF!"}},{"$f":"IF(G34=\"\",\"\",Home!G$25)","v":{"$error":"#REF!"}},{"$f":"IF(A34=\"\",\"\",#REF!)","v":{"$error":"#REF!"}},{"$f":"IF(#REF!=\"\",\"\",#REF!)","v":{"$error":"#REF!"}},{"$f":"IF(A34=\"\",\"\",#REF!)","v":{"$error":"#REF!"}},{"$f":"IF(A34=\"\",\"\",#REF!)","v":{"$error":"#REF!"}},{"$f":"IF(A34=\"\",\"\",#REF!)","v":{"$error":"#REF!"}},{"$f":"IF(A34=\"\",\"\",#REF!)","v":{"$error":"#REF!"}},{"$f":"#REF!","v":{"$error":"#REF!"}},{"$f":"#REF!","v":{"$error":"#REF!"}},{"$f":"IF(A34=\"\",\"\",#REF!)","v":{"$error":"#REF!"}}]
[{"$f":"IF(G35=\"\",\"\",Home!E$10)","v":{"$error":"#REF!"}},{"$f":"IF(G35=\"\",\"\",Home!E$13)","v":{"$error":"#REF!"}},{"$f":"IF(G35=\"\",\"\",Home!E$16)","v":{"$error":"#REF!"}},{"$f":"IF(G35=\"\",\"\",Home!E$25)","v":{"$error":"#REF!"}},{"$f":"IF(G35=\"\",\"\",Home!G$25)","v":{"$error":"#REF!"}},{"$f":"IF(A35=\"\",\"\",#REF!)","v":{"$error":"#REF!"}},{"$f":"IF(#REF!=\"\",\"\",#REF!)","v":{"$error":"#REF!"}},{"$f":"IF(A35=\"\",\"\",#REF!)","v":{"$error":"#REF!"}},{"$f":"IF(A35=\"\",\"\",#REF!)","v":{"$error":"#REF!"}},{"$f":"IF(A35=\"\",\"\",#REF!)","v":{"$error":"#REF!"}},{"$f":"IF(A35=\"\",\"\",#REF!)","v":{"$error":"#REF!"}},{"$f":"#REF!","v":{"$error":"#REF!"}},{"$f":"#REF!","v":{"$error":"#REF!"}},{"$f":"IF(A35=\"\",\"\",#REF!)","v":{"$error":"#REF!"}}]
[{"$f":"IF(G36=\"\",\"\",Home!E$10)","v":{"$error":"#REF!"}},{"$f":"IF(G36=\"\",\"\",Home!E$13)","v":{"$error":"#REF!"}},{"$f":"IF(G36=\"\",\"\",Home!E$16)","v":{"$error":"#REF!"}},{"$f":"IF(G36=\"\",\"\",Home!E$25)","v":{"$error":"#REF!"}},{"$f":"IF(G36=\"\",\"\",Home!G$25)","v":{"$error":"#REF!"}},{"$f":"IF(A36=\"\",\"\",#REF!)","v":{"$error":"#REF!"}},{"$f":"IF(#REF!=\"\",\"\",#REF!)","v":{"$error":"#REF!"}},{"$f":"IF(A36=\"\",\"\",#REF!)","v":{"$error":"#REF!"}},{"$f":"IF(A36=\"\",\"\",#REF!)","v":{"$error":"#REF!"}},{"$f":"IF(A36=\"\",\"\",#REF!)","v":{"$error":"#REF!"}},{"$f":"IF(A36=\"\",\"\",#REF!)","v":{"$error":"#REF!"}},{"$f":"#REF!","v":{"$error":"#REF!"}},{"$f":"#REF!","v":{"$error":"#REF!"}},{"$f":"IF(A36=\"\",\"\",#REF!)","v":{"$error":"#REF!"}}]
[{"$f":"IF(G37=\"\",\"\",Home!E$10)","v":{"$error":"#REF!"}},{"$f":"IF(G37=\"\",\"\",Home!E$13)","v":{"$error":"#REF!"}},{"$f":"IF(G37=\"\",\"\",Home!E$16)","v":{"$error":"#REF!"}},{"$f":"IF(G37=\"\",\"\",Home!E$25)","v":{"$error":"#REF!"}},{"$f":"IF(G37=\"\",\"\",Home!G$25)","v":{"$error":"#REF!"}},{"$f":"IF(A37=\"\",\"\",#REF!)","v":{"$error":"#REF!"}},{"$f":"IF(#REF!=\"\",\"\",#REF!)","v":{"$error":"#REF!"}},{"$f":"IF(A37=\"\",\"\",#REF!)","v":{"$error":"#REF!"}},{"$f":"IF(A37=\"\",\"\",#REF!)","v":{"$error":"#REF!"}},{"$f":"IF(A37=\"\",\"\",#REF!)","v":{"$error":"#REF!"}},{"$f":"IF(A37=\"\",\"\",#REF!)","v":{"$error":"#REF!"}},{"$f":"#REF!","v":{"$error":"#REF!"}},{"$f":"#REF!","v":{"$error":"#REF!"}},{"$f":"IF(A37=\"\",\"\",#REF!)","v":{"$error":"#REF!"}}]
[{"$f":"IF(G38=\"\",\"\",Home!E$10)","v":{"$error":"#REF!"}},{"$f":"IF(G38=\"\",\"\",Home!E$13)","v":{"$error":"#REF!"}},{"$f":"IF(G38=\"\",\"\",Home!E$16)","v":{"$error":"#REF!"}},{"$f":"IF(G38=\"\",\"\",Home!E$25)","v":{"$error":"#REF!"}},{"$f":"IF(G38=\"\",\"\",Home!G$25)","v":{"$error":"#REF!"}},{"$f":"IF(A38=\"\",\"\",#REF!)","v":{"$error":"#REF!"}},{"$f":"IF(#REF!=\"\",\"\",#REF!)","v":{"$error":"#REF!"}},{"$f":"IF(A38=\"\",\"\",#REF!)","v":{"$error":"#REF!"}},{"$f":"IF(A38=\"\",\"\",#REF!)","v":{"$error":"#REF!"}},{"$f":"IF(A38=\"\",\"\",#REF!)","v":{"$error":"#REF!"}},{"$f":"IF(A38=\"\",\"\",#REF!)","v":{"$error":"#REF!"}},{"$f":"#REF!","v":{"$error":"#REF!"}},{"$f":"#REF!","v":{"$error":"#REF!"}},{"$f":"IF(A38=\"\",\"\",#REF!)","v":{"$error":"#REF!"}}]
[{"$f":"IF(G39=\"\",\"\",Home!E$10)","v":{"$error":"#REF!"}},{"$f":"IF(G39=\"\",\"\",Home!E$13)","v":{"$error":"#REF!"}},{"$f":"IF(G39=\"\",\"\",Home!E$16)","v":{"$error":"#REF!"}},{"$f":"IF(G39=\"\",\"\",Home!E$25)","v":{"$error":"#REF!"}},{"$f":"IF(G39=\"\",\"\",Home!G$25)","v":{"$error":"#REF!"}},{"$f":"IF(A39=\"\",\"\",#REF!)","v":{"$error":"#REF!"}},{"$f":"IF(#REF!=\"\",\"\",#REF!)","v":{"$error":"#REF!"}},{"$f":"IF(A39=\"\",\"\",#REF!)","v":{"$error":"#REF!"}},{"$f":"IF(A39=\"\",\"\",#REF!)","v":{"$error":"#REF!"}},{"$f":"IF(A39=\"\",\"\",#REF!)","v":{"$error":"#REF!"}},{"$f":"IF(A39=\"\",\"\",#REF!)","v":{"$error":"#REF!"}},{"$f":"#REF!","v":{"$error":"#REF!"}},{"$f":"#REF!","v":{"$error":"#REF!"}},{"$f":"IF(A39=\"\",\"\",#REF!)","v":{"$error":"#REF!"}}]
[{"$f":"IF(G40=\"\",\"\",Home!E$10)","v":{"$error":"#REF!"}},{"$f":"IF(G40=\"\",\"\",Home!E$13)","v":{"$error":"#REF!"}},{"$f":"IF(G40=\"\",\"\",Home!E$16)","v":{"$error":"#REF!"}},{"$f":"IF(G40=\"\",\"\",Home!E$25)","v":{"$error":"#REF!"}},{"$f":"IF(G40=\"\",\"\",Home!G$25)","v":{"$error":"#REF!"}},{"$f":"IF(A40=\"\",\"\",#REF!)","v":{"$error":"#REF!"}},{"$f":"IF(#REF!=\"\",\"\",#REF!)","v":{"$error":"#REF!"}},{"$f":"IF(A40=\"\",\"\",#REF!)","v":{"$error":"#REF!"}},{"$f":"IF(A40=\"\",\"\",#REF!)","v":{"$error":"#REF!"}},{"$f":"IF(A40=\"\",\"\",#REF!)","v":{"$error":"#REF!"}},{"$f":"IF(A40=\"\",\"\",#REF!)","v":{"$error":"#REF!"}},{"$f":"#REF!","v":{"$error":"#REF!"}},{"$f":"#REF!","v":{"$error":"#REF!"}},{"$f":"IF(A40=\"\",\"\",#REF!)","v":{"$error":"#REF!"}}]
[{"$f":"IF(G41=\"\",\"\",Home!E$10)","v":{"$error":"#REF!"}},{"$f":"IF(G41=\"\",\"\",Home!E$13)","v":{"$error":"#REF!"}},{"$f":"IF(G41=\"\",\"\",Home!E$16)","v":{"$error":"#REF!"}},{"$f":"IF(G41=\"\",\"\",Home!E$25)","v":{"$error":"#REF!"}},{"$f":"IF(G41=\"\",\"\",Home!G$25)","v":{"$error":"#REF!"}},{"$f":"IF(A41=\"\",\"\",#REF!)","v":{"$error":"#REF!"}},{"$f":"IF(#REF!=\"\",\"\",#REF!)","v":{"$error":"#REF!"}},{"$f":"IF(A41=\"\",\"\",#REF!)","v":{"$error":"#REF!"}},{"$f":"IF(A41=\"\",\"\",#REF!)","v":{"$error":"#REF!"}},{"$f":"IF(A41=\"\",\"\",#REF!)","v":{"$error":"#REF!"}},{"$f":"IF(A41=\"\",\"\",#REF!)","v":{"$error":"#REF!"}},{"$f":"#REF!","v":{"$error":"#REF!"}},{"$f":"#REF!","v":{"$error":"#REF!"}},{"$f":"IF(A41=\"\",\"\",#REF!)","v":{"$error":"#REF!"}}]
[{"$f":"IF(G42=\"\",\"\",Home!E$10)","v":{"$error":"#REF!"}},{"$f":"IF(G42=\"\",\"\",Home!E$13)","v":{"$error":"#REF!"}},{"$f":"IF(G42=\"\",\"\",Home!E$16)","v":{"$error":"#REF!"}},{"$f":"IF(G42=\"\",\"\",Home!E$25)","v":{"$error":"#REF!"}},{"$f":"IF(G42=\"\",\"\",Home!G$25)","v":{"$error":"#REF!"}},{"$f":"IF(A42=\"\",\"\",#REF!)","v":{"$error":"#REF!"}},{"$f":"IF(#REF!=\"\",\"\",#REF!)","v":{"$error":"#REF!"}},{"$f":"IF(A42=\"\",\"\",#REF!)","v":{"$error":"#REF!"}},{"$f":"IF(A42=\"\",\"\",#REF!)","v":{"$error":"#REF!"}},{"$f":"IF(A42=\"\",\"\",#REF!)","v":{"$error":"#REF!"}},{"$f":"IF(A42=\"\",\"\",#REF!)","v":{"$error":"#REF!"}},{"$f":"#REF!","v":{"$error":"#REF!"}},{"$f":"#REF!","v":{"$error":"#REF!"}},{"$f":"IF(A42=\"\",\"\",#REF!)","v":{"$error":"#REF!"}}]
[{"$f":"IF(G43=\"\",\"\",Home!E$10)","v":{"$error":"#REF!"}},{"$f":"IF(G43=\"\",\"\",Home!E$13)","v":{"$error":"#REF!"}},{"$f":"IF(G43=\"\",\"\",Home!E$16)","v":{"$error":"#REF!"}},{"$f":"IF(G43=\"\",\"\",Home!E$25)","v":{"$error":"#REF!"}},{"$f":"IF(G43=\"\",\"\",Home!G$25)","v":{"$error":"#REF!"}},{"$f":"IF(A43=\"\",\"\",#REF!)","v":{"$error":"#REF!"}},{"$f":"IF(#REF!=\"\",\"\",#REF!)","v":{"$error":"#REF!"}},{"$f":"IF(A43=\"\",\"\",#REF!)","v":{"$error":"#REF!"}},{"$f":"IF(A43=\"\",\"\",#REF!)","v":{"$error":"#REF!"}},{"$f":"IF(A43=\"\",\"\",#REF!)","v":{"$error":"#REF!"}},{"$f":"IF(A43=\"\",\"\",#REF!)","v":{"$error":"#REF!"}},{"$f":"#REF!","v":{"$error":"#REF!"}},{"$f":"#REF!","v":{"$error":"#REF!"}},{"$f":"IF(A43=\"\",\"\",#REF!)","v":{"$error":"#REF!"}}]
[{"$f":"IF(G44=\"\",\"\",Home!E$10)","v":{"$error":"#REF!"}},{"$f":"IF(G44=\"\",\"\",Home!E$13)","v":{"$error":"#REF!"}},{"$f":"IF(G44=\"\",\"\",Home!E$16)","v":{"$error":"#REF!"}},{"$f":"IF(G44=\"\",\"\",Home!E$25)","v":{"$error":"#REF!"}},{"$f":"IF(G44=\"\",\"\",Home!G$25)","v":{"$error":"#REF!"}},{"$f":"IF(A44=\"\",\"\",#REF!)","v":{"$error":"#REF!"}},{"$f":"IF(#REF!=\"\",\"\",#REF!)","v":{"$error":"#REF!"}},{"$f":"IF(A44=\"\",\"\",#REF!)","v":{"$error":"#REF!"}},{"$f":"IF(A44=\"\",\"\",#REF!)","v":{"$error":"#REF!"}},{"$f":"IF(A44=\"\",\"\",#REF!)","v":{"$error":"#REF!"}},{"$f":"IF(A44=\"\",\"\",#REF!)","v":{"$error":"#REF!"}},{"$f":"#REF!","v":{"$error":"#REF!"}},{"$f":"#REF!","v":{"$error":"#REF!"}},{"$f":"IF(A44=\"\",\"\",#REF!)","v":{"$error":"#REF!"}}]
[{"$f":"IF(G45=\"\",\"\",Home!E$10)","v":{"$error":"#REF!"}},{"$f":"IF(G45=\"\",\"\",Home!E$13)","v":{"$error":"#REF!"}},{"$f":"IF(G45=\"\",\"\",Home!E$16)","v":{"$error":"#REF!"}},{"$f":"IF(G45=\"\",\"\",Home!E$25)","v":{"$error":"#REF!"}},{"$f":"IF(G45=\"\",\"\",Home!G$25)","v":{"$error":"#REF!"}},{"$f":"IF(A45=\"\",\"\",#REF!)","v":{"$error":"#REF!"}},{"$f":"IF(#REF!=\"\",\"\",#REF!)","v":{"$error":"#REF!"}},{"$f":"IF(A45=\"\",\"\",#REF!)","v":{"$error":"#REF!"}},{"$f":"IF(A45=\"\",\"\",#REF!)","v":{"$error":"#REF!"}},{"$f":"IF(A45=\"\",\"\",#REF!)","v":{"$error":"#REF!"}},{"$f":"IF(A45=\"\",\"\",#REF!)","v":{"$error":"#REF!"}},{"$f":"#REF!","v":{"$error":"#REF!"}},{"$f":"#REF!","v":{"$error":"#REF!"}},{"$f":"IF(A45=\"\",\"\",#REF!)","v":{"$error":"#REF!"}}]
[{"$f":"IF(G46=\"\",\"\",Home!E$10)","v":{"$error":"#REF!"}},{"$f":"IF(G46=\"\",\"\",Home!E$13)","v":{"$error":"#REF!"}},{"$f":"IF(G46=\"\",\"\",Home!E$16)","v":{"$error":"#REF!"}},{"$f":"IF(G46=\"\",\"\",Home!E$25)","v":{"$error":"#REF!"}},{"$f":"IF(G46=\"\",\"\",Home!G$25)","v":{"$error":"#REF!"}},{"$f":"IF(A46=\"\",\"\",#REF!)","v":{"$error":"#REF!"}},{"$f":"IF(#REF!=\"\",\"\",#REF!)","v":{"$error":"#REF!"}},{"$f":"IF(A46=\"\",\"\",#REF!)","v":{"$error":"#REF!"}},{"$f":"IF(A46=\"\",\"\",#REF!)","v":{"$error":"#REF!"}},{"$f":"IF(A46=\"\",\"\",#REF!)","v":{"$error":"#REF!"}},{"$f":"IF(A46=\"\",\"\",#REF!)","v":{"$error":"#REF!"}},{"$f":"#REF!","v":{"$error":"#REF!"}},{"$f":"#REF!","v":{"$error":"#REF!"}},{"$f":"IF(A46=\"\",\"\",#REF!)","v":{"$error":"#REF!"}}]

{"sheet":"Export Accom2","index":7,"n_rows":9,"n_cols":14,"rows_kept":9,"cut":false,"hidden":true,"merged":[]}
["Titular","Club","Pais","Adultos","Niños","Hotel","Ocupantes","Entrada","Salida","Noches","Cant Pax","Regimen","Tipo Hab","Precio"]
[0,0,0,0,0,"Hotel Unique","A",45013,45017,4,1,"BB","Single",600]
[0,0,0,0,0,"Hotel Unique","B",45014,45018,4,1,"BB","Single",600]
[0,0,0,0,0,"Hotel Unique","C",45015,45019,4,2,"BB","Double",600]
[0,0,0,0,0,"Hotel Unique","D",45013,45020,7,1,"BB","Single",1050]
[0,0,0,0,0,"Hotel Unique","E",45013,45018,5,2,"BB","Double",750]
[0,0,0,0,0,"Hotel Unique","F",45014,45019,5,1,"BB","Single",750]
[0,0,0,0,0,"Hotel Unique","G",45015,45017,2,2,"BB","Double",300]
[{"$error":"#REF!"},{"$error":"#REF!"},{"$error":"#REF!"},{"$error":"#REF!"},{"$error":"#REF!"},{"$error":"#REF!"},{"$error":"#REF!"},{"$error":"#REF!"},{"$error":"#REF!"},{"$error":"#REF!"},{"$error":"#REF!"},{"$error":"#REF!"},{"$error":"#REF!"},{"$error":"#REF!"}]

{"sheet":"Export Banquet","index":8,"n_rows":16,"n_cols":9,"rows_kept":16,"cut":false,"hidden":true,"merged":[]}
["Titular","Escuela","Pais","Telefono","Email","Invitado","Adulto / Niño","Alergias","Precio"]
[{"$f":"IF(F2=\"\",\"\",Home!E$10)","v":""},{"$f":"IF(F2=\"\",\"\",Home!E$13)","v":""},{"$f":"IF(F2=\"\",\"\",Home!E$16)","v":""},{"$f":"IF(F2=\"\",\"\",Home!E$19)","v":""},{"$f":"IF(F2=\"\",\"\",Home!E$22)","v":""},{"$f":"IF('Banquete IIC'!C11=\"\",\"\",'Banquete IIC'!C11)","v":""},{"$f":"IF('Banquete IIC'!G11=\"\",\"\",'Banquete IIC'!G11)","v":""},{"$f":"IF('Banquete IIC'!I11=\"\",\"\",'Banquete IIC'!I11)","v":""},{"$f":"'Banquete IIC'!M11","v":""}]
[{"$f":"IF(F3=\"\",\"\",Home!E$10)","v":""},{"$f":"IF(F3=\"\",\"\",Home!E$13)","v":""},{"$f":"IF(F3=\"\",\"\",Home!E$16)","v":""},{"$f":"IF(F3=\"\",\"\",Home!E$19)","v":""},{"$f":"IF(F3=\"\",\"\",Home!E$22)","v":""},{"$f":"IF('Banquete IIC'!C12=\"\",\"\",'Banquete IIC'!C12)","v":""},{"$f":"IF('Banquete IIC'!G12=\"\",\"\",'Banquete IIC'!G12)","v":""},{"$f":"IF('Banquete IIC'!I12=\"\",\"\",'Banquete IIC'!I12)","v":""},{"$f":"'Banquete IIC'!M12","v":""}]
[{"$f":"IF(F4=\"\",\"\",Home!E$10)","v":""},{"$f":"IF(F4=\"\",\"\",Home!E$13)","v":""},{"$f":"IF(F4=\"\",\"\",Home!E$16)","v":""},{"$f":"IF(F4=\"\",\"\",Home!E$19)","v":""},{"$f":"IF(F4=\"\",\"\",Home!E$22)","v":""},{"$f":"IF('Banquete IIC'!C13=\"\",\"\",'Banquete IIC'!C13)","v":""},{"$f":"IF('Banquete IIC'!G13=\"\",\"\",'Banquete IIC'!G13)","v":""},{"$f":"IF('Banquete IIC'!I13=\"\",\"\",'Banquete IIC'!I13)","v":""},{"$f":"'Banquete IIC'!M13","v":""}]
[{"$f":"IF(F5=\"\",\"\",Home!E$10)","v":""},{"$f":"IF(F5=\"\",\"\",Home!E$13)","v":""},{"$f":"IF(F5=\"\",\"\",Home!E$16)","v":""},{"$f":"IF(F5=\"\",\"\",Home!E$19)","v":""},{"$f":"IF(F5=\"\",\"\",Home!E$22)","v":""},{"$f":"IF('Banquete IIC'!C14=\"\",\"\",'Banquete IIC'!C14)","v":""},{"$f":"IF('Banquete IIC'!G14=\"\",\"\",'Banquete IIC'!G14)","v":""},{"$f":"IF('Banquete IIC'!I14=\"\",\"\",'Banquete IIC'!I14)","v":""},{"$f":"'Banquete IIC'!M14","v":""}]
[{"$f":"IF(F6=\"\",\"\",Home!E$10)","v":""},{"$f":"IF(F6=\"\",\"\",Home!E$13)","v":""},{"$f":"IF(F6=\"\",\"\",Home!E$16)","v":""},{"$f":"IF(F6=\"\",\"\",Home!E$19)","v":""},{"$f":"IF(F6=\"\",\"\",Home!E$22)","v":""},{"$f":"IF('Banquete IIC'!C15=\"\",\"\",'Banquete IIC'!C15)","v":""},{"$f":"IF('Banquete IIC'!G15=\"\",\"\",'Banquete IIC'!G15)","v":""},{"$f":"IF('Banquete IIC'!I15=\"\",\"\",'Banquete IIC'!I15)","v":""},{"$f":"'Banquete IIC'!M15","v":""}]
[{"$f":"IF(F7=\"\",\"\",Home!E$10)","v":""},{"$f":"IF(F7=\"\",\"\",Home!E$13)","v":""},{"$f":"IF(F7=\"\",\"\",Home!E$16)","v":""},{"$f":"IF(F7=\"\",\"\",Home!E$19)","v":""},{"$f":"IF(F7=\"\",\"\",Home!E$22)","v":""},{"$f":"IF('Banquete IIC'!C16=\"\",\"\",'Banquete IIC'!C16)","v":""},{"$f":"IF('Banquete IIC'!G16=\"\",\"\",'Banquete IIC'!G16)","v":""},{"$f":"IF('Banquete IIC'!I16=\"\",\"\",'Banquete IIC'!I16)","v":""},{"$f":"'Banquete IIC'!M16","v":""}]
[{"$f":"IF(F8=\"\",\"\",Home!E$10)","v":""},{"$f":"IF(F8=\"\",\"\",Home!E$13)","v":""},{"$f":"IF(F8=\"\",\"\",Home!E$16)","v":""},{"$f":"IF(F8=\"\",\"\",Home!E$19)","v":""},{"$f":"IF(F8=\"\",\"\",Home!E$22)","v":""},{"$f":"IF('Banquete IIC'!C17=\"\",\"\",'Banquete IIC'!C17)","v":""},{"$f":"IF('Banquete IIC'!G17=\"\",\"\",'Banquete IIC'!G17)","v":""},{"$f":"IF('Banquete IIC'!I17=\"\",\"\",'Banquete IIC'!I17)","v":""},{"$f":"'Banquete IIC'!M17","v":""}]
[{"$f":"IF(F9=\"\",\"\",Home!E$10)","v":""},{"$f":"IF(F9=\"\",\"\",Home!E$13)","v":""},{"$f":"IF(F9=\"\",\"\",Home!E$16)","v":""},{"$f":"IF(F9=\"\",\"\",Home!E$19)","v":""},{"$f":"IF(F9=\"\",\"\",Home!E$22)","v":""},{"$f":"IF('Banquete IIC'!C18=\"\",\"\",'Banquete IIC'!C18)","v":""},{"$f":"IF('Banquete IIC'!G18=\"\",\"\",'Banquete IIC'!G18)","v":""},{"$f":"IF('Banquete IIC'!I18=\"\",\"\",'Banquete IIC'!I18)","v":""},{"$f":"'Banquete IIC'!M18","v":""}]
[{"$f":"IF(F10=\"\",\"\",Home!E$10)","v":""},{"$f":"IF(F10=\"\",\"\",Home!E$13)","v":""},{"$f":"IF(F10=\"\",\"\",Home!E$16)","v":""},{"$f":"IF(F10=\"\",\"\",Home!E$19)","v":""},{"$f":"IF(F10=\"\",\"\",Home!E$22)","v":""},{"$f":"IF('Banquete IIC'!C19=\"\",\"\",'Banquete IIC'!C19)","v":""},{"$f":"IF('Banquete IIC'!G19=\"\",\"\",'Banquete IIC'!G19)","v":""},{"$f":"IF('Banquete IIC'!I19=\"\",\"\",'Banquete IIC'!I19)","v":""},{"$f":"'Banquete IIC'!M19","v":""}]
[{"$f":"IF(F11=\"\",\"\",Home!E$10)","v":""},{"$f":"IF(F11=\"\",\"\",Home!E$13)","v":""},{"$f":"IF(F11=\"\",\"\",Home!E$16)","v":""},{"$f":"IF(F11=\"\",\"\",Home!E$19)","v":""},{"$f":"IF(F11=\"\",\"\",Home!E$22)","v":""},{"$f":"IF('Banquete IIC'!C20=\"\",\"\",'Banquete IIC'!C20)","v":""},{"$f":"IF('Banquete IIC'!G20=\"\",\"\",'Banquete IIC'!G20)","v":""},{"$f":"IF('Banquete IIC'!I20=\"\",\"\",'Banquete IIC'!I20)","v":""},{"$f":"'Banquete IIC'!M20","v":""}]
[{"$f":"IF(F12=\"\",\"\",Home!E$10)","v":""},{"$f":"IF(F12=\"\",\"\",Home!E$13)","v":""},{"$f":"IF(F12=\"\",\"\",Home!E$16)","v":""},{"$f":"IF(F12=\"\",\"\",Home!E$19)","v":""},{"$f":"IF(F12=\"\",\"\",Home!E$22)","v":""},{"$f":"IF('Banquete IIC'!C21=\"\",\"\",'Banquete IIC'!C21)","v":""},{"$f":"IF('Banquete IIC'!G21=\"\",\"\",'Banquete IIC'!G21)","v":""},{"$f":"IF('Banquete IIC'!I21=\"\",\"\",'Banquete IIC'!I21)","v":""},{"$f":"'Banquete IIC'!M21","v":""}]
[{"$f":"IF(F13=\"\",\"\",Home!E$10)","v":""},{"$f":"IF(F13=\"\",\"\",Home!E$13)","v":""},{"$f":"IF(F13=\"\",\"\",Home!E$16)","v":""},{"$f":"IF(F13=\"\",\"\",Home!E$19)","v":""},{"$f":"IF(F13=\"\",\"\",Home!E$22)","v":""},{"$f":"IF('Banquete IIC'!C22=\"\",\"\",'Banquete IIC'!C22)","v":""},{"$f":"IF('Banquete IIC'!G22=\"\",\"\",'Banquete IIC'!G22)","v":""},{"$f":"IF('Banquete IIC'!I22=\"\",\"\",'Banquete IIC'!I22)","v":""},{"$f":"'Banquete IIC'!M22","v":""}]
[{"$f":"IF(F14=\"\",\"\",Home!E$10)","v":""},{"$f":"IF(F14=\"\",\"\",Home!E$13)","v":""},{"$f":"IF(F14=\"\",\"\",Home!E$16)","v":""},{"$f":"IF(F14=\"\",\"\",Home!E$19)","v":""},{"$f":"IF(F14=\"\",\"\",Home!E$22)","v":""},{"$f":"IF('Banquete IIC'!C23=\"\",\"\",'Banquete IIC'!C23)","v":""},{"$f":"IF('Banquete IIC'!G23=\"\",\"\",'Banquete IIC'!G23)","v":""},{"$f":"IF('Banquete IIC'!I23=\"\",\"\",'Banquete IIC'!I23)","v":""},{"$f":"'Banquete IIC'!M23","v":""}]
[{"$f":"IF(F15=\"\",\"\",Home!E$10)","v":""},{"$f":"IF(F15=\"\",\"\",Home!E$13)","v":""},{"$f":"IF(F15=\"\",\"\",Home!E$16)","v":""},{"$f":"IF(F15=\"\",\"\",Home!E$19)","v":""},{"$f":"IF(F15=\"\",\"\",Home!E$22)","v":""},{"$f":"IF('Banquete IIC'!C24=\"\",\"\",'Banquete IIC'!C24)","v":""},{"$f":"IF('Banquete IIC'!G24=\"\",\"\",'Banquete IIC'!G24)","v":""},{"$f":"IF('Banquete IIC'!I24=\"\",\"\",'Banquete IIC'!I24)","v":""},{"$f":"'Banquete IIC'!M24","v":""}]
[{"$f":"IF(F16=\"\",\"\",Home!E$10)","v":""},{"$f":"IF(F16=\"\",\"\",Home!E$13)","v":""},{"$f":"IF(F16=\"\",\"\",Home!E$16)","v":""},{"$f":"IF(F16=\"\",\"\",Home!E$19)","v":""},{"$f":"IF(F16=\"\",\"\",Home!E$22)","v":""},{"$f":"IF('Banquete IIC'!C25=\"\",\"\",'Banquete IIC'!C25)","v":""},{"$f":"IF('Banquete IIC'!G25=\"\",\"\",'Banquete IIC'!G25)","v":""},{"$f":"IF('Banquete IIC'!I25=\"\",\"\",'Banquete IIC'!I25)","v":""},{"$f":"'Banquete IIC'!M25","v":""}]